{"text_format":"1","workbook":"xlsx","n_sheets":4,"sheets":["Inicio","Siniestros Asignados","Asignados Periodos Anteriores","Base"],"not_rendered":{"charts":0,"images":2,"macros":1,"external_links":0,"defined_names":3,"comments":0,"pivot_tables":0},"unopened":[],"bounds":{"document_bytes":16777216,"sheet_cells":100000,"rows_first":2000,"rows_last":500,"rows_between":2000,"halvings":0,"cell_chars":16384,"cell_head_chars":4096},"cells_cut":0,"cells_raw":0,"read":"whole","date_system":"1900"}

{"sheet":"Inicio","index":0,"n_rows":8,"n_cols":4,"rows_kept":8,"cut":false,"hidden":false,"merged":[[5,1,5,2],[3,1,3,2],[7,1,7,2]]}
[]
["Información Agregada Liquidador de Siniestros"]
[]
["Rut:",123456789,null,"Ingrese el Rut sin punto ni guiones"]
[]
["Nombre Liquidador:",{"$f":"+VLOOKUP(B4,Base!$T$1:$V$299,2,0)","v":"NOMBRE ENTIDAD"}]
[]
["Periodo","2023-12"]

{"sheet":"Siniestros Asignados","index":1,"n_rows":250,"n_cols":28,"rows_kept":250,"cut":false,"hidden":false,"merged":[[5,12,5,15],[0,0,1,10],[3,0,3,13],[6,0,6,1]]}
["Siniestros Asignados"]
[]
[]
[]
[]
[null,null,null,null,null,null,null,null,null,null,null,null,"Motivo de no Pago"]
["Grupo",null,"Compañía","Ramo","N° de Siniestros Asignados","N° de Siniestros Liquidados","Con Recomendación de pago","Plazo Promedio con Pago","Monto Promedio","Monto Efectivo de Pago","Sin Recomendación de pago","Plazo Promedio sin Pago","1.- Sin Cobertura","2.- Bajo deducible","3.- Incumplimiento de contrato por parte del asegurado","4.- Otros","Detalle Otros","Validador",null,null,"MinG","MaxG","MinI","MaxI","MaxL","MaxM","MaxN","ValorK"]
[1,{"$f":"IFERROR(VLOOKUP(A8,Base!$C$2:$D$3,2,0),\"\")","v":"General"},null,null,null,null,null,null,null,null,null,null,null,null,null,null,null,{"$f":"IF(K8=\"\",\"\",IF(SUM(M8:P8)=K8,\"Suma motivo de Pago correcto\",\"Existe un error en la suma de Motivo de Pago\"))","v":""},null,null,{"$f":"IF(LEN(K8)=0,0,F8-K8)","v":0},{"$f":"IF(LEN(K8)=0,F8,F8-K8)","v":0},{"$f":"IF(LEN(G8)=0,0,F8-G8)","v":0},{"$f":"IF(LEN(G8)=0,F8,F8-G8)","v":0},{"$f":"IF(AND(LEN(N8)=0,LEN(O8)=0,LEN(P8)=0),K8,K8-N8-O8-P8)","v":0},{"$f":"IF(AND(LEN(M8)=0,LEN(O8)=0,LEN(P8)=0),K8,K8-M8-O8-P8)","v":0},{"$f":"IF(AND(LEN(M8)=0,LEN(N8)=0,LEN(P8)=0),K8,K8-M8-N8-P8)","v":0},{"$f":"IF(AND(LEN(M8)=0,LEN(N8)=0,LEN(O8)=0),K8,K8-M8-N8-O8)","v":0}]
[null,{"$f":"IFERROR(VLOOKUP(A9,Base!$C$2:$D$3,2,0),\"\")","v":""},null,null,null,null,null,null,null,null,null,null,null,null,null,null,null,{"$f":"IF(K9=\"\",\"\",IF(SUM(M9:P9)=K9,\"Suma motivo de Pago correcto\",\"Existe un error en la suma de Motivo de Pago\"))","v":""},null,null,0,0,0,0,0,0,0,0]
[null,{"$f":"IFERROR(VLOOKUP(A10,Base!$C$2:$D$3,2,0),\"\")","v":""},null,null,null,null,null,null,null,null,null,null,null,null,null,null,null,"",null,null,0,0,0,0,0,0,0,0]
[null,{"$f":"IFERROR(VLOOKUP(A11,Base!$C$2:$D$3,2,0),\"\")","v":""},null,null,null,null,null,null,null,null,null,null,null,null,null,null,null,"",null,null,0,0,0,0,0,0,0,0]
[null,{"$f":"IFERROR(VLOOKUP(A12,Base!$C$2:$D$3,2,0),\"\")","v":""},null,null,null,null,null,null,null,null,null,null,null,null,null,null,null,"",null,null,0,0,0,0,0,0,0,0]
[null,{"$f":"IFERROR(VLOOKUP(A13,Base!$C$2:$D$3,2,0),\"\")","v":""},null,null,null,null,null,null,null,null,null,null,null,null,null,null,null,"",null,null,{"$f":"IF(LEN(K13)=0,0,F13-K13)","v":0},{"$f":"IF(LEN(K13)=0,F13,F13-K13)","v":0},{"$f":"IF(LEN(G13)=0,0,F13-G13)","v":0},{"$f":"IF(LEN(G13)=0,F13,F13-G13)","v":0},{"$f":"IF(AND(LEN(N13)=0,LEN(O13)=0,LEN(P13)=0),K13,K13-N13-O13-P13)","v":0},{"$f":"IF(AND(LEN(M13)=0,LEN(O13)=0,LEN(P13)=0),K13,K13-M13-O13-P13)","v":0},{"$f":"IF(AND(LEN(M13)=0,LEN(N13)=0,LEN(P13)=0),K13,K13-M13-N13-P13)","v":0},{"$f":"IF(AND(LEN(M13)=0,LEN(N13)=0,LEN(O13)=0),K13,K13-M13-N13-O13)","v":0}]
[null,{"$f":"IFERROR(VLOOKUP(A14,Base!$C$2:$D$3,2,0),\"\")","v":""},null,null,null,null,null,null,null,null,null,null,null,null,null,null,null,"",null,null,0,0,0,0,0,0,0,0]
[null,{"$f":"IFERROR(VLOOKUP(A15,Base!$C$2:$D$3,2,0),\"\")","v":""},null,null,null,null,null,null,null,null,null,null,null,null,null,null,null,"",null,null,0,0,0,0,0,0,0,0]
[null,{"$f":"IFERROR(VLOOKUP(A16,Base!$C$2:$D$3,2,0),\"\")","v":""},null,null,null,null,null,null,null,null,null,null,null,null,null,null,null,"",null,null,0,0,0,0,0,0,0,0]
[null,{"$f":"IFERROR(VLOOKUP(A17,Base!$C$2:$D$3,2,0),\"\")","v":""},null,null,null,null,null,null,null,null,null,null,null,null,null,null,null,"",null,null,0,0,0,0,0,0,0,0]
[null,{"$f":"IFERROR(VLOOKUP(A18,Base!$C$2:$D$3,2,0),\"\")","v":""},null,null,null,null,null,null,null,null,null,null,null,null,null,null,null,"",null,null,0,0,0,0,0,0,0,0]
[null,{"$f":"IFERROR(VLOOKUP(A19,Base!$C$2:$D$3,2,0),\"\")","v":""},null,null,null,null,null,null,null,null,null,null,null,null,null,null,null,"",null,null,0,0,0,0,0,0,0,0]
[null,{"$f":"IFERROR(VLOOKUP(A20,Base!$C$2:$D$3,2,0),\"\")","v":""},null,null,null,null,null,null,null,null,null,null,null,null,null,null,null,"",null,null,0,0,0,0,0,0,0,0]
[null,{"$f":"IFERROR(VLOOKUP(A21,Base!$C$2:$D$3,2,0),\"\")","v":""},null,null,null,null,null,null,null,null,null,null,null,null,null,null,null,"",null,null,0,0,0,0,0,0,0,0]
[null,{"$f":"IFERROR(VLOOKUP(A22,Base!$C$2:$D$3,2,0),\"\")","v":""},null,null,null,null,null,null,null,null,null,null,null,null,null,null,null,"",null,null,0,0,0,0,0,0,0,0]
[null,{"$f":"IFERROR(VLOOKUP(A23,Base!$C$2:$D$3,2,0),\"\")","v":""},null,null,null,null,null,null,null,null,null,null,null,null,null,null,null,"",null,null,0,0,0,0,0,0,0,0]
[null,{"$f":"IFERROR(VLOOKUP(A24,Base!$C$2:$D$3,2,0),\"\")","v":""},null,null,null,null,null,null,null,null,null,null,null,null,null,null,null,"",null,null,0,0,0,0,0,0,0,0]
[null,{"$f":"IFERROR(VLOOKUP(A25,Base!$C$2:$D$3,2,0),\"\")","v":""},null,null,null,null,null,null,null,null,null,null,null,null,null,null,null,"",null,null,0,0,0,0,0,0,0,0]
[null,{"$f":"IFERROR(VLOOKUP(A26,Base!$C$2:$D$3,2,0),\"\")","v":""},null,null,null,null,null,null,null,null,null,null,null,null,null,null,null,{"$f":"IF(K26=\"\",\"\",IF(SUM(M26:P26)=K26,\"Suma motivo de Pago correcto\",\"Existe un error en la suma de Motivo de Pago\"))","v":""},null,null,0,0,0,0,0,0,0,0]
[null,{"$f":"IFERROR(VLOOKUP(A27,Base!$C$2:$D$3,2,0),\"\")","v":""},null,null,null,null,null,null,null,null,null,null,null,null,null,null,null,"",null,null,0,0,0,0,0,0,0,0]
[null,{"$f":"IFERROR(VLOOKUP(A28,Base!$C$2:$D$3,2,0),\"\")","v":""},null,null,null,null,null,null,null,null,null,null,null,null,null,null,null,"",null,null,0,0,0,0,0,0,0,0]
[null,{"$f":"IFERROR(VLOOKUP(A29,Base!$C$2:$D$3,2,0),\"\")","v":""},null,null,null,null,null,null,null,null,null,null,null,null,null,null,null,"",null,null,0,0,0,0,0,0,0,0]
[null,{"$f":"IFERROR(VLOOKUP(A30,Base!$C$2:$D$3,2,0),\"\")","v":""},null,null,null,null,null,null,null,null,null,null,null,null,null,null,null,{"$f":"IF(K30=\"\",\"\",IF(SUM(M30:P30)=K30,\"Suma motivo de Pago correcto\",\"Existe un error en la suma de Motivo de Pago\"))","v":""},null,null,0,0,0,0,0,0,0,0]
{"$rows_left_out":221}
{"sheet":"Asignados Periodos Anteriores","index":2,"n_rows":250,"n_cols":28,"rows_kept":250,"cut":false,"hidden":false,"merged":[[0,0,1,10],[3,0,3,13],[5,12,5,15],[6,0,6,1]]}
["Siniestros Asignados Periodos Anteriores"]
[]
[]
[]
[]
[null,null,null,null,null,null,null,null,null,null,null,null,"Motivo de no Pago"]
["Grupo",null,"Compañía","Ramo","N° de Siniestros Asignados","N° de Siniestros Liquidados","Con Recomendación de pago","Plazo Promedio con Pago","Monto Promedio","Monto Efectivo de Pago","Sin Recomendación de pago","Plazo Promedio sin Pago","1.- Sin Cobertura","2.- Bajo deducible","3.- Incumplimiento de contrato por parte del asegurado","4.- Otros","Detalle Otros","Validador",null,null,"MinG","MaxG","MinI","MaxI","MaxL","MaxM","MaxN","ValorK"]
[null,{"$f":"IFERROR(VLOOKUP(A8,Base!$C$2:$D$3,2,0),\"\")","v":""},null,null,null,null,null,null,null,null,null,null,null,null,null,null,null,{"$f":"IF(K8=\"\",\"\",IF(SUM(M8:P8)=K8,\"Suma motivo de Pago correcto\",\"Existe un error en la suma de Motivo de Pago\"))","v":""},null,null,{"$f":"IF(LEN(K8)=0,0,F8-K8)","v":0},{"$f":"IF(LEN(K8)=0,F8,F8-K8)","v":0},{"$f":"IF(LEN(G8)=0,0,F8-G8)","v":0},{"$f":"IF(LEN(G8)=0,F8,F8-G8)","v":0},{"$f":"IF(AND(LEN(N8)=0,LEN(O8)=0,LEN(P8)=0),K8,K8-N8-O8-P8)","v":0},{"$f":"IF(AND(LEN(M8)=0,LEN(O8)=0,LEN(P8)=0),K8,K8-M8-O8-P8)","v":0},{"$f":"IF(AND(LEN(M8)=0,LEN(N8)=0,LEN(P8)=0),K8,K8-M8-N8-P8)","v":0},{"$f":"IF(AND(LEN(M8)=0,LEN(N8)=0,LEN(O8)=0),K8,K8-M8-N8-O8)","v":0}]
[null,{"$f":"IFERROR(VLOOKUP(A9,Base!$C$2:$D$3,2,0),\"\")","v":""},null,null,null,null,null,null,null,null,null,null,null,null,null,null,null,{"$f":"IF(K9=\"\",\"\",IF(SUM(M9:P9)=K9,\"Suma motivo de Pago correcto\",\"Existe un error en la suma de Motivo de Pago\"))","v":""},null,null,0,0,0,0,0,{"$f":"IF(AND(LEN(M9)=0,LEN(O9)=0,LEN(P9)=0),K9,K9-M9-O9-P9)","v":0},{"$f":"IF(AND(LEN(M9)=0,LEN(N9)=0,LEN(P9)=0),K9,K9-M9-N9-P9)","v":0},{"$f":"IF(AND(LEN(M9)=0,LEN(N9)=0,LEN(O9)=0),K9,K9-M9-N9-O9)","v":0}]
[null,{"$f":"IFERROR(VLOOKUP(A10,Base!$C$2:$D$3,2,0),\"\")","v":""},null,null,null,null,null,null,null,null,null,null,null,null,null,null,null,"",null,null,0,0,0,0,0,0,0,0]
[null,{"$f":"IFERROR(VLOOKUP(A11,Base!$C$2:$D$3,2,0),\"\")","v":""},null,null,null,null,null,null,null,null,null,null,null,null,null,null,null,"",null,null,0,0,0,0,0,0,0,0]
[null,{"$f":"IFERROR(VLOOKUP(A12,Base!$C$2:$D$3,2,0),\"\")","v":""},null,null,null,null,null,null,null,null,null,null,null,null,null,null,null,"",null,null,0,0,0,0,0,0,0,0]
[null,{"$f":"IFERROR(VLOOKUP(A13,Base!$C$2:$D$3,2,0),\"\")","v":""},null,null,null,null,null,null,null,null,null,null,null,null,null,null,null,"",null,null,0,0,0,0,0,0,0,0]
[null,{"$f":"IFERROR(VLOOKUP(A14,Base!$C$2:$D$3,2,0),\"\")","v":""},null,null,null,null,null,null,null,null,null,null,null,null,null,null,null,"",null,null,0,0,0,0,0,0,0,0]
[null,{"$f":"IFERROR(VLOOKUP(A15,Base!$C$2:$D$3,2,0),\"\")","v":""},null,null,null,null,null,null,null,null,null,null,null,null,null,null,null,"",null,null,0,0,0,0,0,0,0,0]
[null,{"$f":"IFERROR(VLOOKUP(A16,Base!$C$2:$D$3,2,0),\"\")","v":""},null,null,null,null,null,null,null,null,null,null,null,null,null,null,null,"",null,null,0,0,0,0,0,0,0,0]
[null,{"$f":"IFERROR(VLOOKUP(A17,Base!$C$2:$D$3,2,0),\"\")","v":""},null,null,null,null,null,null,null,null,null,null,null,null,null,null,null,"",null,null,0,0,0,0,0,0,0,0]
[null,{"$f":"IFERROR(VLOOKUP(A18,Base!$C$2:$D$3,2,0),\"\")","v":""},null,null,null,null,null,null,null,null,null,null,null,null,null,null,null,"",null,null,0,0,0,0,0,0,0,0]
[null,{"$f":"IFERROR(VLOOKUP(A19,Base!$C$2:$D$3,2,0),\"\")","v":""},null,null,null,null,null,null,null,null,null,null,null,null,null,null,null,"",null,null,0,0,0,0,0,0,0,0]
[null,{"$f":"IFERROR(VLOOKUP(A20,Base!$C$2:$D$3,2,0),\"\")","v":""},null,null,null,null,null,null,null,null,null,null,null,null,null,null,null,"",null,null,0,0,0,0,0,0,0,0]
[null,{"$f":"IFERROR(VLOOKUP(A21,Base!$C$2:$D$3,2,0),\"\")","v":""},null,null,null,null,null,null,null,null,null,null,null,null,null,null,null,"",null,null,0,0,0,0,0,0,0,0]
[null,{"$f":"IFERROR(VLOOKUP(A22,Base!$C$2:$D$3,2,0),\"\")","v":""},null,null,null,null,null,null,null,null,null,null,null,null,null,null,null,"",null,null,0,0,0,0,0,0,0,0]
[null,{"$f":"IFERROR(VLOOKUP(A23,Base!$C$2:$D$3,2,0),\"\")","v":""},null,null,null,null,null,null,null,null,null,null,null,null,null,null,null,"",null,null,0,0,0,0,0,0,0,0]
[null,{"$f":"IFERROR(VLOOKUP(A24,Base!$C$2:$D$3,2,0),\"\")","v":""},null,null,null,null,null,null,null,null,null,null,null,null,null,null,null,"",null,null,0,0,0,0,0,0,0,0]
[null,{"$f":"IFERROR(VLOOKUP(A25,Base!$C$2:$D$3,2,0),\"\")","v":""},null,null,null,null,null,null,null,null,null,null,null,null,null,null,null,"",null,null,0,0,0,0,0,0,0,0]
[null,{"$f":"IFERROR(VLOOKUP(A26,Base!$C$2:$D$3,2,0),\"\")","v":""},null,null,null,null,null,null,null,null,null,null,null,null,null,null,null,"",null,null,0,0,0,0,0,0,0,0]
[null,{"$f":"IFERROR(VLOOKUP(A27,Base!$C$2:$D$3,2,0),\"\")","v":""},null,null,null,null,null,null,null,null,null,null,null,null,null,null,null,"",null,null,0,0,0,0,0,0,0,0]
[null,{"$f":"IFERROR(VLOOKUP(A28,Base!$C$2:$D$3,2,0),\"\")","v":""},null,null,null,null,null,null,null,null,null,null,null,null,null,null,null,"",null,null,0,0,0,0,0,0,0,0]
[null,{"$f":"IFERROR(VLOOKUP(A29,Base!$C$2:$D$3,2,0),\"\")","v":""},null,null,null,null,null,null,null,null,null,null,null,null,null,null,null,"",null,null,0,0,0,0,0,0,0,0]
[null,{"$f":"IFERROR(VLOOKUP(A30,Base!$C$2:$D$3,2,0),\"\")","v":""},null,null,null,null,null,null,null,null,null,null,null,null,null,null,null,"",null,null,0,0,0,0,0,0,0,0]
{"$rows_left_out":221}
{"sheet":"Base","index":3,"n_rows":249,"n_cols":21,"rows_kept":249,"cut":false,"hidden":true,"merged":[]}
["Periodo",null,"Grupo compañía","Grupo",null,1,"General","1.-Incendio",null,null,"Grupo compañía 1","Rut Grupo 1",null,null,null,"Siniestros Liquidación directa",null,null,"rut","rutsin","nombre"]
["2020-06",null,1,"General",null,1,"General","2.-Pérdida de beneficio por incendio",null,1,"ASEGURADORA PORVENIR S.A.","76598625-7",null,null,"1.-Incendio",{"$f":"+COUNTIF('Siniestros Asignados'!$A$8:$A$251,Base!O2)","v":0},null,null,"10067127-1",100671271,"SILVA LIGUEÑO JUAN MAURICIO"]
["2020-12",null,2,"Vida",null,1,"General","3.-Otros Riesgos adicionales a incendio",null,1,"ASSURANT CHILE COMPAÑIA DE SEGUROS GENERALES S.A.","76212519-6",null,null,"2.-Pérdida de beneficio por incendio",{"$f":"+COUNTIF('Siniestros Asignados'!$A$8:$A$251,Base!O3)","v":0},null,null,"10151232-0",101512320,"VALDÉS GÓMEZ PAOLO ALEJANDRO"]
["2021-06",null,null,null,null,1,"General","4.-Terremoto y Tsunami",null,1,"BCI SEGUROS GENERALES S.A.","99147000-K",null,null,"3.-Otros Riesgos adicionales a incendio",{"$f":"+COUNTIF('Siniestros Asignados'!$A$8:$A$251,Base!O4)","v":0},null,null,"10191670-7",101916707,"MARCHANT BARRIAS JOHN OSVALDO"]
["2021-12",null,null,null,null,1,"General","5.-Pérdida de beneficio por Terremoto",null,1,"BNP PARIBAS CARDIF SEGUROS GENERALES S.A.","96837640-3",null,null,"4.-Terremoto y Tsunami",{"$f":"+COUNTIF('Siniestros Asignados'!$A$8:$A$251,Base!O5)","v":0},null,null,"10273448-3",102734483,"CORREA LABARCA PAULO LUIS"]
["2022-06",null,null,null,null,1,"General","6.-Otros Riesgos de la naturaleza",null,1,"CHUBB SEGUROS CHILE S.A.","99225000-3",null,null,"5.-Pérdida de beneficio por Terremoto",{"$f":"+COUNTIF('Siniestros Asignados'!$A$8:$A$251,Base!O6)","v":0},null,null,"10325420-5",103254205,"DE LA CUADRA CUADRA FRANCISCO JAVIER"]
["2022-12",null,null,null,null,1,"General","7.-Terrorismo",null,1,"COMPAÑIA DE SEGUROS GENERALES CONSORCIO NACIONAL DE SEGUROS S.A.","96654180-6",null,null,"6.-Otros Riesgos de la naturaleza",{"$f":"+COUNTIF('Siniestros Asignados'!$A$8:$A$251,Base!O7)","v":0},null,null,"10350523-2",103505232,"CANALES ESPINOZA EDUARDO ANTONIO"]
["2023-06",null,null,null,null,1,"General","8.-Robo",null,1,"COMPAÑIA DE SEGUROS GENERALES CONTINENTAL S.A.","76039758-K",null,null,"7.-Terrorismo",{"$f":"+COUNTIF('Siniestros Asignados'!$A$8:$A$251,Base!O8)","v":0},null,null,"10400140-8",104001408,"FERREIRA YAÑEZ PAOLA LUISA"]
["2023-12",null,null,null,null,1,"General","9.-Cristales",null,1,"CONTEMPORA COMPAÑIA DE SEGUROS GENERALES S.A.","76981875-8",null,null,"8.-Robo",{"$f":"+COUNTIF('Siniestros Asignados'!$A$8:$A$251,Base!O9)","v":0},null,null,"10488305-2",104883052,"JIMENEZ VALIENTE CARLOS PATRICIO"]
[null,null,null,null,null,1,"General","10.-Daños físicos Vehículos Motorizados",null,1,"EVEREST COMPAÑIA DE SEGUROS GENERALES CHILE S.A.","77591207-3",null,null,"9.-Cristales",{"$f":"+COUNTIF('Siniestros Asignados'!$A$8:$A$251,Base!O10)","v":0},null,null,"10584047-0",105840470,"GOMEZ AEDO GREGORIO ALEJANDRO"]
[null,null,null,null,null,1,"General","11.-Casco Marítimo",null,1,"FID CHILE SEGUROS GENERALES S.A.","77096952-2",null,null,"10.-Daños físicos Vehículos Motorizados",{"$f":"+COUNTIF('Siniestros Asignados'!$A$8:$A$251,Base!O11)","v":0},null,null,"10632507-3",106325073,"ARANCIBIA BUSTAMANTE JUAN MAURICIO"]
["Tipo","Grupo",null,null,null,1,"General","12.-Casco Aéreo",null,1,"HDI SEGUROS S.A.","99231000-6",null,null,"11.-Casco Marítimo",{"$f":"+COUNTIF('Siniestros Asignados'!$A$8:$A$251,Base!O12)","v":0},null,null,"10658174-6",106581746,"PORTILLA ALARCON PABLO CESAR"]
["CSG",1,null,null,null,1,"General","13.-Responsabilidad civil Hogar y Condominios",null,1,"LIBERTY COMPAÑIA DE SEGUROS GENERALES S.A.","99061000-2",null,null,"12.-Casco Aéreo",{"$f":"+COUNTIF('Siniestros Asignados'!$A$8:$A$251,Base!O13)","v":0},null,null,"10696129-8",106961298,"ALARCON BENAVIDES CRISTIAN ENRIQUE"]
["CSC",1,null,null,null,1,"General","14.-Responsabilidad civil Profesional",null,1,"MAPFRE COMPAÑIA DE SEGUROS GENERALES DE CHILE S.A.","96508210-7",null,null,"13.-Responsabilidad civil Hogar y Condominios",{"$f":"+COUNTIF('Siniestros Asignados'!$A$8:$A$251,Base!O14)","v":0},null,null,"10810368-K","10810368K","ZAPATA VALENZUELA FELIPE ANDRÉS"]
["CSV",2,null,null,null,1,"General","15.-Responsabilidad civil Industria, Infraestructura y Comercio",null,1,"METLIFE CHILE SEGUROS GENERALES S.A.","76328793-9",null,null,"14.-Responsabilidad civil Profesional",{"$f":"+COUNTIF('Siniestros Asignados'!$A$8:$A$251,Base!O15)","v":0},null,null,"10835420-8",108354208,"CHUAQUI SCHADOW GABRIEL ALEJANDRO"]
[null,null,null,null,null,1,"General","16.-Responsabilidad civil Vehículos Motorizados",null,1,"MUTUALIDAD DE CARABINEROS (Generales)","99024000-0",null,null,"15.-Responsabilidad civil Industria, Infraestructura y Comercio",{"$f":"+COUNTIF('Siniestros Asignados'!$A$8:$A$251,Base!O16)","v":0},null,null,"10849830-7",108498307,"BURGOS MUÑOZ RAFAEL EUGENIO"]
[null,null,null,null,null,1,"General","17.-Transporte terrestre",null,1,"ORION SEGUROS GENERALES S.A.","76042965-1",null,null,"16.-Responsabilidad civil Vehículos Motorizados",{"$f":"+COUNTIF('Siniestros Asignados'!$A$8:$A$251,Base!O17)","v":0},null,null,"10851547-3",108515473,"MARTICORENA SALINAS JOSE MIGUEL"]
[null,null,null,null,null,1,"General","18.-Transporte Marítimo",null,1,"REALE CHILE SEGUROS GENERALES S.A.","76743492-8",null,null,"17.-Transporte terrestre",{"$f":"+COUNTIF('Siniestros Asignados'!$A$8:$A$251,Base!O18)","v":0},null,null,"10912187-8",109121878,"ALTMANN COBOS FELIPE EDUARDO"]
[null,null,null,null,null,1,"General","19.-Transporte Aéreo",null,1,"RENTA NACIONAL COMPAÑIA DE SEGUROS GENERALES S.A.","94510000-1",null,null,"18.-Transporte Marítimo",{"$f":"+COUNTIF('Siniestros Asignados'!$A$8:$A$251,Base!O19)","v":0},null,null,"10919806-4",109198064,"YAÑEZ GOMEZ JAVIER ORNALDO"]
[null,null,null,null,null,1,"General","20.-Equipo Contratista",null,1,"SEGUROS GENERALES SURAMERICANA S.A.","99017000-2",null,null,"19.-Transporte Aéreo",{"$f":"+COUNTIF('Siniestros Asignados'!$A$8:$A$251,Base!O20)","v":0},null,null,"10962229-K","10962229K","ORELLANA HERNANDEZ SONIA ALEJANDRA"]
[null,null,null,null,null,1,"General","21.-Todo Riesgo Construcción y Montaje",null,1,"SOUTHBRIDGE COMPAÑIA DE SEGUROS GENERALES S.A.","99288000-7",null,null,"20.-Equipo Contratista",{"$f":"+COUNTIF('Siniestros Asignados'!$A$8:$A$251,Base!O21)","v":0},null,null,"10985204-K","10985204K","VERGARA SOTO CRISTIAN RODRIGO"]
[null,null,null,null,null,1,"General","22.-Avería de Maquinaria",null,1,"STARR INTERNATIONAL SEGUROS GENERALES S.A.","76620932-7",null,null,"21.-Todo Riesgo Construcción y Montaje",{"$f":"+COUNTIF('Siniestros Asignados'!$A$8:$A$251,Base!O22)","v":0},null,null,"11140005-9",111400059,"DE BEER SORIANO CARLOS JAVIER"]
[null,null,null,null,null,1,"General","23.-Equipo Eléctrico",null,1,"UNNIO SEGUROS GENERALES S.A.","76173258-7",null,null,"22.-Avería de Maquinaria",{"$f":"+COUNTIF('Siniestros Asignados'!$A$8:$A$251,Base!O23)","v":0},null,null,"11324360-0",113243600,"MARIN BORQUEZ HECTOR HUGO"]
[null,null,null,null,null,1,"General","24.-Garantía",null,1,"ZENIT SEGUROS GENERALES S.A.","76061223-5",null,null,"23.-Equipo Eléctrico",{"$f":"+COUNTIF('Siniestros Asignados'!$A$8:$A$251,Base!O24)","v":0},null,null,"11345916-6",113459166,"GONZALEZ CUEVAS DAVID ALEJANDRO"]
[null,null,null,null,null,1,"General","25.-Fidelidad",null,1,"ZURICH CHILE SEGUROS GENERALES S.A.","99037000-1",null,null,"24.-Garantía",{"$f":"+COUNTIF('Siniestros Asignados'!$A$8:$A$251,Base!O25)","v":0},null,null,"11482367-8",114823678,"ALVAREZ GOMEZ ROBERTO CARLOS"]
[null,null,null,null,null,1,"General","26.-Seguro extensión y Garantía",null,1,"ZURICH SANTANDER SEGUROS GENERALES CHILE S.A.","76590840-K",null,null,"25.-Fidelidad",{"$f":"+COUNTIF('Siniestros Asignados'!$A$8:$A$251,Base!O26)","v":0},null,null,"11676174-2",116761742,"MELLA LABRAÑA MARCELO ANDRES"]
[null,null,null,null,null,1,"General","27.-Seguro de Crédito por venta a plazo",null,1,"AVLA SEGUROS DE CREDITO Y GARANTIA S.A.","76363534-1",null,null,"26.-Seguro extensión y Garantía",{"$f":"+COUNTIF('Siniestros Asignados'!$A$8:$A$251,Base!O27)","v":0},null,null,"11687570-5",116875705,"BARRUETO OAKLEY ALBERTO EDGARDO"]
[null,null,null,null,null,1,"General","28.-Seguro de Crédito a la exportación",null,1,"CESCE CHILE ASEGURADORA S.A.","76015592-6",null,null,"27.-Seguro de Crédito por venta a plazo",{"$f":"+COUNTIF('Siniestros Asignados'!$A$8:$A$251,Base!O28)","v":0},null,null,"11823181-3",118231813,"MOHOR PINTO FAISAL"]
[null,null,null,null,null,1,"General","29.-Otros seguros de crédito",null,1,"COMPAÑIA DE SEGUROS DE CREDITO CONTINENTAL S.A.","96573590-9",null,null,"28.-Seguro de Crédito a la exportación",{"$f":"+COUNTIF('Siniestros Asignados'!$A$8:$A$251,Base!O29)","v":0},null,null,"11911884-0",119118840,"GOMEZ RUIZ MONICA IVONNE"]
[null,null,null,null,null,1,"General","30.-Salud",null,1,"COMPAÑIA DE SEGUROS DE CREDITOS COFACE CHILE S.A.","96831690-7",null,null,"29.-Otros seguros de crédito",{"$f":"+COUNTIF('Siniestros Asignados'!$A$8:$A$251,Base!O30)","v":0},null,null,"12005422-8",120054228,"VERGARA LIRA JOSE FRANCISCO"]
{"$rows_left_out":219}